RANDOM FOREST
type: Concept
change note: 2022-07-27 12:34:10.0 [tstevens] update Definition (Encyclopedia of Machine Learning and Data Science: https://doi.org/10.1007/978-1-4899-7502-7);
change note: 2022-07-26 08:08:03.0 [tstevens] insert Definition (id: null text: A type of supervised learning that uses multiple decision trees for a computer to find patterns in data. language code: en);
change note: 2022-07-25 15:46:40.0 [tstevens] Insert Concept add broader relation (RANDOM FOREST [a68048f4-181c-4c6c-9bfa-9e4171e9f237,996694] - ENSEMBLE MODELS [35d2677c-619a-4a47-a5a7-3feb9973c5ab,996692]);
in scheme: sciencekeywords
definition: A type of supervised learning that uses multiple decision trees for a computer to find patterns in data.

ENSEMBLE MODELS
type: Concept