Earth Observation Satellites
type: Concept

NISAR
type: Concept
definition: The NASA-ISRO Synthetic Aperture Radar (SAR), or NISAR, Mission will make global integrated measurements of the causes and consequences of land surface changes. NISAR will provide a means of resolving highly spatial and temporally complex processes ranging from ecosystem disturbances, to ice sheet collapse and natural hazards including earthquakes, tsunamis, volcanoes, and landslides. 2022 (planned) More information: https://nisar.jpl.nasa.gov/
change note: 2017-09-14 14:48:26.0 [sritz] update Definition (The NASA-ISRO Synthetic Aperture Radar (SAR), or NISAR, Mission will make global integrated measurements of the causes and consequences of land surface changes. NISAR will provide a means of resolving highly spatial and temporally complex processes ranging from ecosystem disturbances, to ice sheet collapse and natural hazards including earthquakes, tsunamis, volcanoes, and landslides. 2020-21 (planned));
change note: 2018-03-12 12:32:45.0 [sritz] update Definition (The NASA-ISRO Synthetic Aperture Radar (SAR), or NISAR, Mission will make global integrated measurements of the causes and consequences of land surface changes. NISAR will provide a means of resolving highly spatial and temporally complex processes ranging from ecosystem disturbances, to ice sheet collapse and natural hazards including earthquakes, tsunamis, volcanoes, and landslides. 2020-21 (planned) More information: https://nisar.jpl.nasa.gov/);
change note: 2017-09-14 14:32:28.0 [sritz] Insert Concept add broader relation (NISAR [a6fddcb3-881b-484a-bbc9-39591b6359ab,310183] - Earth Observation Satellites [3466eed1-2fbb-49bf-ab0b-dc08731d502b,287601]);
change note: 2020-12-29 16:15:34.0 [sritz] update Definition (The NASA-ISRO Synthetic Aperture Radar (SAR), or NISAR, Mission will make global integrated measurements of the causes and consequences of land surface changes. NISAR will provide a means of resolving highly spatial and temporally complex processes ranging from ecosystem disturbances, to ice sheet collapse and natural hazards including earthquakes, tsunamis, volcanoes, and landslides. 2022 (planned) More information: https://nisar.jpl.nasa.gov/);
change note: 2017-09-14 14:34:34.0 [sritz] insert AltLabel (id: null category: primary text: NASA-ISRO Synthetic Aperture Radar language code: en); insert Definition (id: null text: The NASA-ISRO Synthetic Aperture Radar (SAR), or NISAR, Mission will make global integrated measurements of the causes and consequences of land surface changes. NISAR will provide a means of resolving highly spatial and temporally complex processes ranging from ecosystem disturbances, to ice sheet collapse and natural hazards including earthquakes, tsunamis, volcanoes, and landslides. language code: en);
in scheme: platforms