BELGIUM
type: Concept

BE/RMIB
type: Concept
in scheme: providers
definition: The IST World portal offers information about experts, research groups, centers and companies involved in creating the technologies for the growing information society. Focus of the service is the expertise and experience of relevant players in European countries. Summary Provided By: http://www.ist-world.org/OrgUnitDetails.aspx?OrgUnitId=9ac70ce973754dbbad19f08abf45b4c4