LAND USE/LAND COVER
type: Concept

DISTURBANCE
type: Concept
change note: 2022-12-15 08:06:49.0 [tstevens] insert Definition (id: null text: Any event that occurs outside the range of natural variability and may be due to human-induced or natural causes. language code: en);
change note: 2022-12-15 08:05:57.0 [tstevens] Insert Concept add broader relation (DISTURBANCE [a71560e7-42c5-4cbe-96fc-368de3b05a5f,1143779] - LAND USE/LAND COVER [e5815f58-8232-4c7f-b50d-ea71d73891a9,1140384]);
in scheme: sciencekeywords
definition: Any event that occurs outside the range of natural variability and may be due to human-induced or natural causes.