CORAL REEFS
type: Concept

PATCH REEF
type: Concept
change note: 2013-08-20 08:48:07.0 [tbs1979] insert Definition (id: null text: An isolated, comparatively small reef outcrop, usually within a lagoon or embayment, often circular and surrounded by sand or seagrass. Patch reefs are common. language code: en);
change note: 2013-08-06 08:10:05.0 [tbs1979] Insert Concept add broader relation (PATCH REEF [a722fea3-fe54-4995-8aec-407efe20dee9,105493] - CORAL REEFS [c6244bfb-300f-4818-bf45-cf1a15e7e073,105487]);
in scheme: sciencekeywords
definition: An isolated, comparatively small reef outcrop, usually within a lagoon or embayment, often circular and surrounded by sand or seagrass. Patch reefs are common.