BASAL ICE FREEZING
type: Concept
change note: 2013-04-01 11:04:31.0 [tbs1979] insert Definition (id: null text: A process made by made by glaciohydraulic supercooling, though some studies show that even where physical conditions allow it to occur, the process may not be responsible for observed sequences of basal ice. language code: en);
change note: 2013-03-05 08:54:31.0 [tbs1979] Insert Concept add broader relation (BASAL ICE FREEZING [a72c8430-0b33-4167-b189-1309cc2048c5,82791] - FREEZE/THAW [f7849055-fa5c-437c-a8c6-08c7db3a3b0a,82789]);
in scheme: sciencekeywords
definition: A process made by made by glaciohydraulic supercooling, though some studies show that even where physical conditions allow it to occur, the process may not be responsible for observed sequences of basal ice.

FREEZE/THAW
type: Concept