CONSORTIA/INSTITUTIONS
type: Concept

ROpenSci
type: Concept
change note: 2021-01-26 07:51:33.0 [tstevens] insert Definition (id: null text: rOpenSci fosters a culture that values open and reproducible research using shared data and reusable software. language code: en); insert Resource (id: null type: provider url: https://ropensci.org/);
change note: 2021-01-26 07:46:31.0 [tstevens] Insert Concept add broader relation (ROpenSci [a73ac292-bb7b-438e-beac-96648f36ea40,560821] - CONSORTIA/INSTITUTIONS [aef2fc80-def0-46a4-9259-9dc37e80ed08,533799]);
in scheme: providers
definition: rOpenSci fosters a culture that values open and reproducible research using shared data and reusable software.