Resurs-P N1
type: Concept
change note: 2021-11-18 12:59:50.0 [tstevens] Move Concepts delete broader relation (null); add broader relation (Resurs-P N1 [a7560954-fe13-4e8a-bb12-1289154a3a24,826595] - Earth Observation Satellites [3466eed1-2fbb-49bf-ab0b-dc08731d502b,826121]);
change note: 2021-12-01 12:30:29.0 [tstevens] Move Concepts delete broader relation (null); add broader relation (Resurs-P N1 [a7560954-fe13-4e8a-bb12-1289154a3a24,826595] - Resurs [ef6c9735-8d68-4432-9e5e-a2c1ccd2fa90,835929]);
change note: 2015-08-03 08:41:31.0 [mpmorahan] Insert Concept add broader relation (Resurs-P N1 [a7560954-fe13-4e8a-bb12-1289154a3a24,158123] - Earth Observation Satellites [3466eed1-2fbb-49bf-ab0b-dc08731d502b,143415]);
change note: 2021-11-18 12:44:06.0 [tstevens] Move Concepts delete broader relation (null); add broader relation (Resurs-P N1 [a7560954-fe13-4e8a-bb12-1289154a3a24,826595] - Space-based Platforms [b39a69b4-c3b9-4a94-b296-bbbbe5e4c847,835875]);
change note: 2015-08-03 08:45:44.0 [mpmorahan] insert AltLabel (id: null text: Environmental Satellite Resurs-P N1 language code: en);
in scheme: platforms
definition: Environmental Satellite Resurs-P N1 Group: Platform_Details Entry_ID: Resurs-P N1 Group: Platform_Identification Platform_Category: Earth Observation Satellites Short_Name: Resurs-P N1 Long_Name: Environmental Satellite Resurs-P N1 End_Group Group: Platform_Associated_Instruments Short_Name: GSA Short_Name: SHMSA-VR Short_Name: SHMSA-SR Short_Name: Geoton-L1 (2) End_Group Group: Orbit Orbit_Altitude: 475 km Orbit_Inclination: 97 degrees Repeat_Cycle: 3 days Orbit_Type: LEO > LOW EARTH ORBIT > POLAR SUN-SYNCHRONOUS End_Group Creation_Date: 2015-01-26 Online_Resource: http://samspace.ru/products/earth_remote_sensing_satellites/ka_resurs_p/ Online_Resource: http://en.samspace.ru/products/earth_remote_sensing_satellites/ka_resurs_p/ Sample_Image: http://www.ntsomz.ru/img/resurs-p_scheme.jpg Group: Platform_Logistics Launch_Date: 2013-06-25 Design_Life: 5 years End_Group End_Group

Resurs
type: Concept