C-130
type: Concept
change note: 2021-11-17 11:51:52.0 [tstevens] Move Concepts delete broader relation (null); add broader relation (C-130 [a790e30f-5a13-4188-befb-2647a884034b,826598] - Propeller [6175c78e-432c-4254-b442-40d3cf0f6b34,835882]);
in scheme: platforms
definition: The C-130 Hercules primarily performs the intratheater portion of the airlift mission. The aircraft is capable of operating from rough, dirt strips and is the prime transport for paradropping troops and equipment into hostile areas. Basic and specialized versions perform a diversity of roles, including airlift support, DEW Line and Arctic ice resupply, aeromedical missions, aerial spray missions, fire-fighting duties for the US Forest Service, and natural disaster relief missions. In recent years, they have been used to bring humanitarian relief to many countries, including Haiti, Bosnia, Somalia, and Rwanda. Four decades have elapsed since the Air Force issued its original design specification, yet the remarkable C-130 remains in production. The turbo-prop, high-wing, versatile "Herc" has accumulated over 20 million flight hours. It is the preferred transport aircraft for many US Government services and over 60 foreign countries. The basic airframe has been modified to hundreds of different configurations to meet an ever-changing environment and mission requirement. The C-130 Hercules has unsurpassed versatility, performance, and mission effectiveness. Early C-130A, B, and D versions are now retired. [Text provided by: http://www.fas.org/man/dod-101/sys/ac/c-130.htm ] [Photo provided by: http://www.globalaircraft.org/ ] Group: Platform_Details Entry_ID: C-130 Group: Platform_Identification Platform_Category: Aircraft Short_Name: C-130 Long_Name: Lockheed C-130 Hercules End_Group Creation_Date: 2008-07-14 Online_Resource: http://en.wikipedia.org/wiki/C-130_Hercules Online_Resource: http://www.af.mil/factsheets/factsheet.asp?fsID=92 Sample_Image: http://www.globalaircraft.org/photos/planephotos/c-130_1.jpg End_Group

Propeller
type: Concept