NON-GOVERNMENT/NON-PROFIT ORGANIZATIONS
type: Concept

AMNH/SB
type: Concept
in scheme: providers
definition: The American Museum of Natural History presents Science Bulletins, an innovative online and exhibition program that offers the public a window into the excitement of scientific discovery. Science Bulletins is a video program that brings you the latest developments in the fields of astrophysics, Earth science, biodiversity and human biology and evolution through documentary feature stories about scientists in the field and regular brief research updates using scientific visualizations and imagery. In the exhibition halls of the American Museum of Natural History and other museums and science centers throughout the world, Science Bulletins presents Astro, Earth, Human, and Bio Bulletins as updating streams of high-definition video content and interactive media. On this Web site, Science Bulletins presents current videos and provides an archive of past stories, all with resource links, as well as educator resources and a guide for educators interested in using Science Bulletins in the classroom. Summary Provided By: http://www.amnh.org/sciencebulletins/