ELSEVIER
type: Concept
in scheme: providers
definition: Elsevier is a world leading, multiple-media publisher of scientific, technical and health information products and services, with 7,000 employees in 99 locations around the globe. Elsevier is an integral partner with the scientific, technical and health communities, delivering superior information products and services that foster communication, build insights, and enable individual and collective advancement in scientific research and health care. Website: "http://www.elsevier.com/" [Summary provided by Elsevier]

COMMERCIAL
type: Concept