ATMOSPHERIC RADIATION
type: Concept

SHORTWAVE RADIATION
type: Concept
change note: 2021-05-12 15:56:33.0 [sritz] Insert Concept add narrower relation (SHORTWAVE RADIATION [a8f5c969-34e9-4284-afb5-ff2113f5f881,604550] - DOWNWELLING SHORTWAVE RADIATION [74de6492-617b-4046-8a4e-1336c3238a7e,606938]);
in scheme: sciencekeywords
definition: Shortwave radiation is radiation at wavelengths shorter than 4 microns. Sometimes called the solar radiation. Usually radiation in the visible and near-infrared wavelengths.

DOWNWELLING SHORTWAVE RADIATION
type: Concept