Kanopus-V
type: Concept
change note: 2015-08-03 09:01:05.0 [mpmorahan] insert AltLabel (id: null text: Environmental Satellite Kanopus-V language code: en);
change note: 2015-08-03 08:57:15.0 [mpmorahan] Insert Concept add broader relation (Kanopus-V [a93bb213-7862-4aa5-a113-38669e557a76,158131] - Earth Observation Satellites [3466eed1-2fbb-49bf-ab0b-dc08731d502b,143415]);
in scheme: platforms
definition: Environmental Satellite Kanopus-V Group: Platform_Details Entry_ID: Kanopus-V Group: Platform_Identification Platform_Category: Earth Observation Satellites Short_Name: Kanopus-V Long_Name: Environmental Satellite Kanopus-V End_Group Group: Platform_Associated_Instruments Short_Name: PSS_RS Short_Name: MSS_RS End_Group Group: Orbit Orbit_Altitude: 510 km Orbit_Inclination: 97.4 degrees Period: 94.7 minutes Repeat_Cycle: 5 days Orbit_Type: LEO > LOW EARTH ORBIT > POLAR SUN-SYNCHRONOUS End_Group Creation_Date: 2015-08-19 Online_Resource: http://vniiem.ru/ru/index.php?option=com_content&view=article&id=622:-l-r-1-3-4-5-6&catid=85:--l-r&Itemid=62 Sample_Image: http://vniiem.ru/ru/uploads/images/kanopus_3b.jpg Group: Platform_Logistics Launch_Date: 2011-01-20 Design_Life: 10 years End_Group End_Group

Earth Observation Satellites
type: Concept