IRM
type: Concept
change note: 2019-04-25 13:15:33.0 [mmorahan] insert AltLabel (id: null category: primary text: Imaging and Rapid-scanning Ion Mass Spectrometer language code: en); insert Definition (id: null text: The IRM (Imaging and Rapid-scanning Ion Mass Spectrometer) objective is to observe the mass composition and 3-D velocity distributions (energy and angular) of ions in the energy range of 0.1-100 eV and 1-40 amu/q. language code: en); insert WeightedRelation (id: null related concept uuid: 66f5d236-40fb-4a41-96a4-761d48103765 relationship type: null relationship value: null generated by: null);
change note: 2019-04-25 13:12:54.0 [mmorahan] Insert Concept add broader relation (IRM [a96885e0-9dc1-4edb-bc29-1cdb320d50f2,368681] - Spectrometers [055a79c7-61db-4250-abad-f1e09909f14c,346207]);
in scheme: instruments
definition: The IRM (Imaging and Rapid-scanning Ion Mass Spectrometer) objective is to observe the mass composition and 3-D velocity distributions (energy and angular) of ions in the energy range of 0.1-100 eV and 1-40 amu/q.

Spectrometers
type: Concept