NON-GOVERNMENT/NON-PROFIT ORGANIZATIONS
type: Concept

BIOSIS
type: Concept
in scheme: providers
definition: BIOSIS is a non-profit organization that delivers flexible information services ? including databases and customized information products ? to the global life sciences community. What BIOSIS does? -Selects Documents from thousands of sources worldwide. -Indexes and abstracts them into citations which describe their content. -Maintains Databases for searching citations - adding more than 600,000 new entries each year. Website: "http://www.biosis.org/" [Summary provided by BIOSIS.]