WATER VAPOR TRANSPORT
type: Concept
change note: 2017-03-15 17:28:19.0 [sritz] insert Definition (id: null text: Movement of water vapor through the atmosphere. language code: en);
change note: 2013-02-14 12:47:11.0 [mpmorahan] Insert Concept add broader relation (WATER VAPOR TRANSPORT [a997c21b-ca61-4e78-8828-aa3e144976c3,82297] - CLOUD DYNAMICS [62019831-aaba-4d63-a5cd-73138ccfa5d0,82131]);
in scheme: sciencekeywords
definition: Movement of water vapor through the atmosphere.

CLOUD DYNAMICS
type: Concept