ACMAP
type: Concept
change note: 2022-08-12 12:47:52.0 [tstevens] insert AltLabel (id: null category: primary text: Atmospheric Composition Modeling and Analysis Program language code: en); insert Definition (id: null text: The Atmospheric Composition Modeling and Analysis Program (ACMAP) uses models to help integrate observations from multiple satellite, airborne- and ground-based instruments in four main areas: air quality and oxidation efficiency in the troposphere, how pollution-sourced aerosols affect cloud properties, stratospheric chemistry and ozone depletion, and interactions between atmospheric chemistry and climate. ACMAP also supports small amounts of research into long-term trends in atmospheric composition. language code: en);
change note: 2022-08-12 12:46:01.0 [tstevens] Insert Concept add broader relation (ACMAP [a9e09d38-e482-4886-8575-ec5829ed072b,1011388] - A - C [0c89f3f4-7ab1-43ce-89ee-795d35f0e30a,1004311]);
in scheme: projects
definition: The Atmospheric Composition Modeling and Analysis Program (ACMAP) uses models to help integrate observations from multiple satellite, airborne- and ground-based instruments in four main areas: air quality and oxidation efficiency in the troposphere, how pollution-sourced aerosols affect cloud properties, stratospheric chemistry and ozone depletion, and interactions between atmospheric chemistry and climate. ACMAP also supports small amounts of research into long-term trends in atmospheric composition.

A - C
type: Concept