Thermal/Radiation Detectors
type: Concept

PYRRADIOMETERS
type: Concept
change note: 2021-08-05 16:55:03.0 [sritz] insert AltLabel (id: null category: primary text: PYRRADIOMETERS language code: en);
in scheme: instruments
definition: Pyrradiometers are instruments used for the measurement of radiation in the total spectrum of the solar radiation. [Summary provided by Process Controls and Instrumentation]