M - O
type: Concept

MISR Plume Height
type: Concept
definition: Researchers from the MISR Active Aerosol Plume-Height (AAP) Project, based out of NASA Goddard Space Flight Center in Greenbelt, Maryland and the University of Maryland, used data from NASA's Terra satellite to map the properties and near-source dispersion of smoke plumes from California’s Milepost 21 wildfire that burned during August 2020. Credit: MISR Active Aerosol Plume-Height (AAP) Project / K.J. Noyes, R. Kahn, J. Limbacher (NASA Goddard Space Flight Center) At least seven major wildfires...
change note: 2020-12-02 15:07:21.0 [sritz] Insert Concept add broader relation (MISR Plume Height [aaab8422-9eab-4b99-8fd2-d3f6856dcea2,560785] - M - O [a31c2828-9b6d-44e9-b6ad-7ae81030f322,548709]);
change note: 2020-12-02 15:08:02.0 [sritz] insert AltLabel (id: null category: primary text: Multi-angle Imaging SpectroRadiometer (MISR) Plume Height language code: en);
change note: 2020-12-02 15:10:22.0 [sritz] insert Definition (id: null text: Researchers from the MISR Active Aerosol Plume-Height (AAP) Project, based out of NASA Goddard Space Flight Center in Greenbelt, Maryland and the University of Maryland, used data from NASA's Terra satellite to map the properties and near-source dispersion of smoke plumes from California’s Milepost 21 wildfire that burned during August 2020. Credit: MISR Active Aerosol Plume-Height (AAP) Project / K.J. Noyes, R. Kahn, J. Limbacher (NASA Goddard Space Flight Center) At least seven major wildfires... language code: en);
in scheme: projects