NON-GOVERNMENT/NON-PROFIT ORGANIZATIONS
type: Concept

MOSAIC
type: Concept
in scheme: providers
definition: Mosaic Conservation was formed by Bob Smith and Matt Walpole in 2003. Our goal is to promote and develop technical and analytical excellence in biodiversity conservation and natural resource management.