WHOI/AOPE
type: Concept
in scheme: providers
definition: The Applied Ocean Physics and Engineering Department (AOPE) is a unique collection of scientists, engineers, technical support personnel and students conducting research into ocean processes from the turbulent surf zone to the abyssal depths. This research encompasses air-sea interaction on local and global scales, mixing processes, sediment transport, estuarine and coastal hydrodynamics, ocean acoustics, underwater communication, internal waves, signal processing, mooring dynamics, and physical-biological processes.

CONSORTIA/INSTITUTIONS
type: Concept