GEOMETRY OF INTERNAL REFLECTIONS
type: Concept
change note: 2017-03-15 13:12:33.0 [mgenazzi] Definition added insert Definition (id: null text: Changes in crystal-orientation fabric, changes in conductivity or changes in the amount of bubbles (respectively density) are considered to cause internal reflections in glaciers and ice sheets language code: en);
change note: 2015-05-01 15:50:18.0 [aaleman] Insert Concept add broader relation (GEOMETRY OF INTERNAL REFLECTIONS [ab319cdf-a34c-446c-9fc0-27605048364e,157907] - GLACIERS/ICE SHEETS [8603db51-3484-4439-8b3b-a06f48e8c686,83513]);
in scheme: sciencekeywords
definition: Changes in crystal-orientation fabric, changes in conductivity or changes in the amount of bubbles (respectively density) are considered to cause internal reflections in glaciers and ice sheets

GLACIERS/ICE SHEETS
type: Concept