Beidou RECEIVERS
type: Concept
change note: 2017-08-15 10:27:29.0 [tstevens] insert Definition (id: null text: The BeiDou Navigation Satellite System (BDS) is China's second-generation satellite navigation system that will be capable of providing positioning, navigation, and timing services to users on a continuous worldwide basis. The first and second generation of BeiDou receivers are already available, including the combination of GPS and BeiDou systems - currently limited to the available regional services - with already over a thousand users. language code: en);
change note: 2017-08-14 15:41:48.0 [tstevens] Insert Concept add broader relation (Beidou RECEIVERS [ab691c1b-9cca-461b-a726-6df04da70576,309983] - Beidou [43d17037-c574-4abc-9831-d9c5064e00f7,309975]);
in scheme: instruments
definition: The BeiDou Navigation Satellite System (BDS) is China's second-generation satellite navigation system that will be capable of providing positioning, navigation, and timing services to users on a continuous worldwide basis. The first and second generation of BeiDou receivers are already available, including the combination of GPS and BeiDou systems - currently limited to the available regional services - with already over a thousand users.

Beidou
type: Concept