ITPR
type: Concept
change note: 2020-12-22 11:33:20.0 [sritz] update WeightedRelation (Platform-Instrument); update WeightedRelation (1.0);
change note: 2020-12-22 11:27:10.0 [sritz] insert AltLabel (id: null category: primary text: Infrared Temperature Profile Radiometer language code: en); insert Definition (id: null text: The Nimbus 5 Infrared Temperature Profile Radiometer (ITPR) experiment was designed to measure the three-dimensional temperature field in the earth's atmosphere with a spatial resolution of 32 km. The radiometer sensed four intervals in the 15-micrometer CO2 band, one interval in the water vapor rotational band near 20 micrometers and two spectral intervals in the atmospheric window regions near 3.7 and 11 micrometers. language code: en);
change note: 2020-12-22 11:25:14.0 [sritz] Insert Concept add broader relation (ITPR [ac24596b-164b-406d-a67f-956ac0cd3238,560799] - Radiometers [5b753e40-b3f1-426a-8d92-ffee1d675468,544211]);
change note: 2020-12-22 11:32:22.0 [sritz] insert WeightedRelation (id: null related concept uuid: 955e7643-bd77-44aa-ba05-f7b841ce582b relationship type: null relationship value: null generated by: null);
definition: The Nimbus 5 Infrared Temperature Profile Radiometer (ITPR) experiment was designed to measure the three-dimensional temperature field in the earth's atmosphere with a spatial resolution of 32 km. The radiometer sensed four intervals in the 15-micrometer CO2 band, one interval in the water vapor rotational band near 20 micrometers and two spectral intervals in the atmospheric window regions near 3.7 and 11 micrometers.
in scheme: instruments

Radiometers
type: Concept