USDA
type: Concept

USDA/FS/SRS/SGCP
type: Concept
in scheme: providers
definition: Treesearch is an online system for locating and delivering publications by Research and Development scientists in the US Forest Service. Publications in the collection include research monographs published by the agency as well as papers written by our scientists but published by other organizations in their journals, conference proceedings, or books. Research results behind these publications have been peer reviewed to ensure the best quality science. Summary provided by: http://www.treesearch.fs.fed.us/about/