PAN
type: Concept
in scheme: instruments
definition: The Indian Remote Sensing satellites IRS-1C/1D carried the Panchromatic Camera (PAN), which uses an all-reflective folded mirror telescope along with three seperately mounted 4096-element CCD arrays. Each detector array has separate interference filters and four LEDs along with a cylindrical lens. Group: Instrument_Details Entry_ID: PAN Group: Instrument_Identification Instrument_Category: Earth Remote Sensing Instruments Instrument_Class: Passive Remote Sensing Instrument_Type: Photon/Optical Detectors Instrument_Subtype: Cameras Short_Name: PAN Long_Name: IRS Panchromatic Camera End_Group Group: Instrument_Associated_Sensors Short_Name: CAMERAS End_Group Group: Associated_Platforms Short_Name: IRS-1D Short_Name: IRS-1C End_Group Group: Spectral_Frequency_Information Wavelength_Keyword: Visible Number_Channels: 1 Spectral_Frequency_Coverage_Range: 0.50 μm – 0.75 μm End_Group Online_Resource: http://www.nrsa.gov.in/satellites/irs-1d.html Creation_Date: 2008-08-15 Group: Instrument_Logistics Instrument_Owner: India End_Group End_Group

Cameras
type: Concept