DE/UK/IMK
type: Concept
in scheme: providers
definition: The diploma course of studies meteorology at the university enjoys of large popularity with a high number of first-year university students. The university teachers of the IMK welcome the large interest and look forward training the students. They refer however to the substantial requirements in physics and mathematics, which unfortunately lead to a high ratio of aborters. Study-interested should inform absolutely about the study plans , instructional contents and requirements. Summary provided by http://www.imk.uni-karlsruhe.de/

GERMANY
type: Concept