SPECIES/POPULATION INTERACTIONS
type: Concept

MICROBIAL CHANGES
type: Concept
change note: 2020-05-13 12:40:58.0 [tstevens] Insert Concept add broader relation (MICROBIAL CHANGES [adf5f515-c7b4-4662-a144-580659957ce1,560117] - SPECIES/POPULATION INTERACTIONS [58f39353-7e1c-4884-9501-376cd0377fbf,84195]);
in scheme: sciencekeywords
definition: Changes and adaptations to microorganisms and their communities.