A - C
type: Concept

Climate
type: Concept
change note: 2017-06-14 12:13:32.0 [sritz] update PrefLabel (climate collection); update Definition (The ORNL DAAC archives climate data sets that include measured and modeled values for variables such as temperature, precipitation, humidity, radiation, wind velocity, and cloud cover. The climate collection includes station measurement data as well as gridded mean values for the variables.);
change note: 2017-06-07 10:32:08.0 [tstevens] update AltLabel (Climate Collection);
change note: 2017-06-19 14:10:44.0 [sritz] update PrefLabel (climate);
change note: 2018-11-13 08:28:48.0 [tstevens] update PrefLabel (Climate);
definition: The ORNL DAAC archives climate data sets that include measured and modeled values for variables such as temperature, precipitation, humidity, radiation, wind velocity, and cloud cover. The climate collection includes station measurement data as well as gridded mean values for the variables.
in scheme: projects