Permanent Land Sites
type: Concept

OBSERVATORIES
type: Concept
change note: 2022-02-08 13:00:31.0 [tstevens] update Definition (Observatories: Buildings or places designed and equipped for making observations of astronomical, meteorological, or other natural phenomena.);
change note: 2021-11-17 14:09:13.0 [tstevens] Move Concepts delete broader relation (null); add broader relation (OBSERVATORIES [ae0531ae-ee94-4861-bcd0-5b9000b87c38,826630] - Permanent Land Sites [0ec10fd9-492c-498a-b6d8-e2840cc3643b,835887]);
in scheme: platforms
definition: Observatories: Buildings or places designed and equipped for making observations of astronomical, meteorological, or other natural phenomena.