GLACIAL LANDFORMS
type: Concept

CIRQUES/COMBES
type: Concept
change note: 2013-04-01 09:48:34.0 [tbs1979] insert Definition (id: null text: Glacially eroded rock basin found on mountains. Most alpine glaciers originate from a cirque. language code: en);
change note: 2013-03-05 08:24:26.0 [tbs1979] Insert Concept add broader relation (CIRQUES/COMBES [ae3b0c3d-35a1-4c94-ba72-ffe1a641902e,82727] - GLACIAL LANDFORMS [3c78951a-0293-4fb0-baff-ec7372fe784d,64133]);
in scheme: sciencekeywords
definition: Glacially eroded rock basin found on mountains. Most alpine glaciers originate from a cirque.