ICE DRAFT
type: Concept
change note: 2022-04-22 08:22:57.0 [tstevens] insert Definition (id: null text: A measurement of the ice thickness below the waterline and often serves as a close proxy for total ice thickness. language code: en);
change note: 2022-04-22 08:21:32.0 [tstevens] Insert Concept add broader relation (ICE DRAFT [ae4869cc-65f4-4f24-a77b-b77637f8818c,894387] - SEA ICE [d73e969a-4b66-4713-8d63-fa3cbb1e25e3,890956]);
in scheme: sciencekeywords
definition: A measurement of the ice thickness below the waterline and often serves as a close proxy for total ice thickness.

SEA ICE
type: Concept