ACSOE-MAGE
type: Concept
in scheme: projects
definition: Marine Aerosol and Gas Exchange (MAGE) was a component of the NERC Atmospheric Chemistry Studies in the Oceanic Environment (ACSOE) project aimed at studying chemical exchange across the air-sea interface. The component included two experiments that were purely a part of ACSOE: Eastern Atlantic Experiment (spring 1996 and 1997) North Atlantic Experiment (June 1998) In addition, MAGE contributed ship time in October 1996 to the EU ASGAMAGE project and this was included as an experiment within the organisational structure of MAGE.

A - C
type: Concept