UNI-HAMBURG/TU/IRCE
type: Concept
in scheme: providers
definition: The TUHH is one of the youngest universities in Germany as well as one of the most successful. Between 1982 and today an attractive architectural ensemble was created on the TUHH campus in the south of Hamburg. The campus, with its modern buildings, fits most naturally into the surrounding parkland. With the combination of beauty and function the university has become a landmark in city-planning.

ACADEMIC
type: Concept