DHC-3
type: Concept
change note: 2021-11-17 11:54:19.0 [tstevens] Move Concepts delete broader relation (null); add broader relation (DHC-3 [aef364b1-6a71-49c0-b248-6dc1ecd4eaa3,826632] - Propeller [6175c78e-432c-4254-b442-40d3cf0f6b34,835882]);
in scheme: platforms
definition: The DeHavilland DHC-3 Otter's primary purpose is for utility and personnel transport. However, the DHC-3 was used by the U.S. Military and the Canadian Military as a search and rescue aircraft. Group: Platform_Details Entry_ID: DHC-3 Group: Platform_Identification Platform_Category: Aircraft Short_Name: DHC-3 Long_Name: DeHavilland DHC-3 Otter End_Group Creation_Date: 2012-07-23 Online_Resource: http://www.dhc3otter.com/profile.htm End_Group

Propeller
type: Concept