Earth Observation Satellites
type: Concept

PARASOL
type: Concept
definition: Polarization and Anisotropy of Reflectances for Atmospheric Sciences coupled with Observations from a Lidar (PARASOL) is the second microsatellite in the Myriade series developed by CNES. It is carrying a wide-field imaging radiometer/polarimeter called POLDER (Polarization and Directionality of the Earth's Reflectances), designed in partnership with the LOA atmospheric optics laboratory in Lille (CNRS-USTL). POLDER is designed to improve our knowledge of the radiative and microphysical properties of clouds and aerosols by measuring the directionality and polarization of light reflected by the Earth-atmosphere system. [Summary provided by CNES.] Group: Platform_Details Entry_ID: PARASOL Group: Platform_Identification Platform_Category: Earth Observation Satellites Platform_Series_or_Entity: EOS (Earth Observing System) Short_Name: PARASOL End_Group Group: Platform_Associated_Instruments Short_Name: POLDER End_Group Group: Orbit Orbit_Altitude: 705 km Orbit_Type: LEO > Low Earth Orbit > Polar Sun-Synchronous End_Group Creation_Date: 2007-05-21 Online_Resource: http://missions-scientifiques.cnes.fr/PARASOL/Fr/ Sample_Image: http://smsc.cnes.fr/IcPARASOL/satellite.gif Group: Platform_Logistics Launch_Date: 2004-12-18 Launch_Site: Kourou, French Guiana Design_Life: 1 Year Primary_Sponsor: CNES End_Group End_Group
in scheme: platforms
change note: 2021-11-18 12:46:11.0 [tstevens] Move Concepts delete broader relation (null); add broader relation (PARASOL [aef6c60c-b5c5-46b9-9a84-d99a9c08b06a,826633] - Space-based Platforms [b39a69b4-c3b9-4a94-b296-bbbbe5e4c847,835875]);
change note: 2021-11-18 12:50:18.0 [tstevens] Move Concepts delete broader relation (null); add broader relation (PARASOL [aef6c60c-b5c5-46b9-9a84-d99a9c08b06a,826633] - Earth Observation Satellites [3466eed1-2fbb-49bf-ab0b-dc08731d502b,826121]);
change note: 2020-10-07 11:21:58.0 [mmorahan] insert AltLabel (id: null category: primary text: Polarization and Anisotropy of Reflectances for Atmospheric Sciences coupled with Observations from a Lidar language code: en); update Resource (image);