OrbView-2
type: Concept
change note: 2021-11-18 12:47:07.0 [tstevens] Move Concepts delete broader relation (null); add broader relation (OrbView-2 [aef85316-b8f8-422a-add0-8130b113fa7d,826634] - Space-based Platforms [b39a69b4-c3b9-4a94-b296-bbbbe5e4c847,835875]);
change note: 2021-12-02 09:42:57.0 [tstevens] Move Concepts delete broader relation (null); add broader relation (OrbView-2 [aef85316-b8f8-422a-add0-8130b113fa7d,826634] - OrbView [f221869f-1552-4f72-a308-7e79d0ab98e1,835941]);
change note: 2019-02-22 09:00:15.0 [mmorahan] insert WeightedRelation (id: null related concept uuid: 769780b8-ba0e-4cd2-9575-88953c1010a0 relationship type: null relationship value: null generated by: null);
change note: 2017-11-14 13:54:23.0 [tstevens] update Definition (OrbView-2 is an imaging satellite, developed, owned, managed and operated by Orbital Imaging Corporation (OrbImage) of Dulles, VA. The overall objective of the OrbView-2/SeaWiFS mission is to provide quantitative data on global ocean bio-optical properties to the Earth science community. The OrbView-2 satellite includes the SeaWiFS (Sea-Viewing Wide Field-of-View Sensor) imaging system, an 8-band multispectral imaging instrument with a one kilometer spatial resolution.);
change note: 2017-11-14 13:53:09.0 [tstevens] update AltLabel (SEASTAR ); update PrefLabel (OrbView-2); update Resource (image);
change note: 2021-11-18 13:46:12.0 [tstevens] Move Concepts delete broader relation (null); add broader relation (OrbView-2 [aef85316-b8f8-422a-add0-8130b113fa7d,826634] - Earth Observation Satellites [3466eed1-2fbb-49bf-ab0b-dc08731d502b,826121]);
change note: 2016-06-09 13:19:17.0 [epneff] added altLabel insert AltLabel (id: null text: OrbView-2 language code: en);
change note: 2020-01-29 16:58:54.0 [sritz] update Resource (https://oceancolor.gsfc.nasa.gov/SeaWiFS/IMAGES/seastar_orbit.jpg);
in scheme: platforms
alternative label: SEASTAR
definition: OrbView-2 is an imaging satellite, developed, owned, managed and operated by Orbital Imaging Corporation (OrbImage) of Dulles, VA. The overall objective of the OrbView-2/SeaWiFS mission is to provide quantitative data on global ocean bio-optical properties to the Earth science community. The OrbView-2 satellite includes the SeaWiFS (Sea-Viewing Wide Field-of-View Sensor) imaging system, an 8-band multispectral imaging instrument with a one kilometer spatial resolution.

OrbView
type: Concept