FLUVIAL LANDFORMS
type: Concept

RIFFLE
type: Concept
change note: 2013-08-15 13:11:17.0 [tbs1979] insert Definition (id: null text: A shallow stretch of a river or stream, where the current is above the average stream velocity and where the water forms small rippled waves as a result. language code: en);
change note: 2013-08-05 12:37:49.0 [tbs1979] Insert Concept add broader relation (RIFFLE [af058c0e-d40b-4e59-9f92-67b59fd1e2bd,105331] - FLUVIAL LANDFORMS [bdc0bd86-a3a3-48fa-b1fb-4ca5d13d4dde,105281]);
in scheme: sciencekeywords
definition: A shallow stretch of a river or stream, where the current is above the average stream velocity and where the water forms small rippled waves as a result.