MULTINATIONAL ORGANIZATIONS
type: Concept

IMBER
type: Concept
in scheme: providers
definition: MBER is an IGBP-SCOR project focusing on ocean biogeochemical cycles and ecosystems. The IMBER vision is to provide a comprehensive understanding of, and accurate predictive capacity for, ocean responses to accelerating global change and the consequent effects on the Earth System and human society.