TARANTELLA
type: Concept
in scheme: projects
definition: Short Title: TARANTELLA Project URL: http://www.tarantella.aq/ Proposal URL: http://classic.ipy.org/development/eoi/proposal-details.php?id=59 TARANTELLA stands for Terrestrial ecosystems in ARctic and ANTarctic: Effects of UV Light, Liquefying ice, and Ascending temperatures. It is a project in the framework of the International Polar Year (http://www.ipy.org, IPY project no. 59) Predicted changes in climate and ozone concentrations in Polar regions, make it critically important to understand how changes in key environmental factors influence Polar terrestrial ecosystems via the modification of their individual but interconnected components. TARANTELLA aims to coordinate these studies by focusing on the experimental approach, in both the Arctic, in collaboration with ITEX, and in the Antarctic. A common methodology is used, the so-called Open-top chambers (OTC) or small greenhouses for temperature manipulations; for UV-B field research UV-B supplementation (lamps) and/or UV-B exclusion (foils), are used to experimentally establish varied UV-B levels. The objectives of TARANTELLA are : * To compare the effects of experimentally induced climate change and enhanced UV-B radiation * To study and analyse effects of temperature (including moisture and nutrient availability) and UV-B radiation manipulations deployed over different periods of time and in different localities * To compare the patterns and processes of manipulated with non-manipulated natural controls. * To study these changes along latitudinal and altitudinal gradients. * To study plant morphological and chemical effects in response to UV-B radiation * To test how the balance between facilitation versus competition among autotrophic species varies with temperature and UV-B radiation and other climatic variables * To investigate the effects of environmental perturbation on carbon- and nutrient dynamics within and between the different compartments of the ecosystem

S - U
type: Concept