FEATURE PORTRAYAL SERVICE
type: Concept
in scheme: sciencekeywords
definition: Dynamically produces client-specified pictorial renderings in an image or graphics format of features and feature collections usually dynamically retrieved from a Web Feature Server (WFS).

DATA PROCESSING SERVICES
type: Concept