SOIL TEXTURE
type: Concept
in scheme: sciencekeywords
definition: The relative proportions of the various soil separates in a soil, as described by the percent clay, sand, and silt.

SOILS
type: Concept