INFRARED RADIOMETERS
type: Concept
change note: 2021-08-05 12:22:35.0 [sritz] insert AltLabel (id: null category: primary text: INFRARED RADIOMETERS language code: en);
in scheme: instruments
definition: INFRARED RADIOMETERS are meters used to detect and measure radiant energy that is either electromagnetic or acoustic and that is also in the infrared part of the electromagnetic spectrum (visible spectrum at its red end); Infrared is electromagnetic wave frequencies below the visible range which have wavelengths longer than light but shorter than radio waves. Group: Instrument_Details Entry_ID: INFRARED RADIOMETERS Group: Instrument_Identification Instrument_Category: Earth Remote Sensing Instruments Instrument_Class: Passive Remote Sensing Instrument_Type: Spectrometers/Radiometers Instrument_Subtype: Radiometers Short_Name: INFRARED RADIOMETERS End_Group Group: Associated_Platforms Short_Name: METEOR 2-21 End_Group End_Group

Radiometers
type: Concept