USDA
type: Concept

USDA/ARS/SPARC/APMU
type: Concept
in scheme: providers
definition: The mission of the Area Wide Pest Management Research Unit is to develop, integrate, and evaluate multiple strategies and technologies into system approaches for management of field and food crop insect pests. Website: "http://apmru.usda.gov/" [Summary provided by the USDA.]