Space Station
type: Concept

SKYLAB
type: Concept
change note: 2021-12-01 13:31:05.0 [tstevens] Move Concepts delete broader relation (null); add broader relation (SKYLAB [b0f992d7-3ff5-4470-849a-a540a9f8ce3e,826645] - Space Station [a4297e6c-efe4-4194-8309-0b8bd658445b,835934]);
change note: 2021-11-30 12:14:23.0 [tstevens] Move Concepts delete broader relation (null); add broader relation (SKYLAB [b0f992d7-3ff5-4470-849a-a540a9f8ce3e,826645] - Space Stations/Crewed Spacecraft [388e72a1-b851-4b78-9e69-747e06ae215f,826132]);
change note: 2021-11-30 09:57:10.0 [tstevens] Move Concepts delete broader relation (null); add broader relation (SKYLAB [b0f992d7-3ff5-4470-849a-a540a9f8ce3e,826645] - Space-based Platforms [b39a69b4-c3b9-4a94-b296-bbbbe5e4c847,835875]);
in scheme: platforms
definition: The Skylab (SL) was a manned, orbiting spacecraft composed of five parts: the Apollo telescope mount (ATM), the multiple docking adapter (MDA), the airlock module (AM), the instrument unit (IU), and the orbital workshop (OWS). The Skylab was in the form of a cylinder, with the ATM being positioned 90 degrees from the longitudinal axis after insertion into orbit. The ATM was a solar observatory, and it provided attitude control and experiment pointing for the rest of the cluster. The retrieval and installation of film used in the ATM was accomplished by astronauts during extravehicular activity (EVA). The MDA served as a dock for the command and service modules, which served as personnel taxies to the Skylab. The OWS was a modified Saturn 4B stage suitable for long duration manned habitation in orbit. It contained provisions and crew quarters necessary to support three-person crews for periods of up to 84 days each. All parts were also capable of unmanned, in-orbit storage, reactivation, and reuse. The Skylab itself was launched on May 14, 1973. It was first manned during the period May 25 to June 22, 1973, by the crew of the SL-2 mission. Next, it was manned during the period July 28 to September 25, 1973, by the crew of the SL-3 mission. The final manned period was from November 16, 1973, to February 8, 1974, when it was manned by the crew from the SL-4 mission. Group: Platform_Details Entry_ID: SKYLAB Group: Platform_Identification Platform_Category: Space Stations/Manned Spacecraft Short_Name: SKYLAB End_Group Group: Synonymous_Platform_Names Short_Name: skylab End_Group Creation_Date: 2008-01-31 Online_Resource: http://science.ksc.nasa.gov/history/skylab/skylab.html Sample_Image: http://www.nasa.gov/images/content/144461main_skylab_over_earth2.jpg Group: Platform_Logistics Launch_Date: 1973-05-14 Primary_Sponsor: NASA End_Group End_Group