FROZEN GROUND
type: Concept

ROCK GLACIERS
type: Concept
in scheme: sciencekeywords
definition: A mass of rock fragments and finer material, on a slope, that contains either interstitial ice or an ice core and shows evidence of past or present movement.