MARINE STRATOCUMULUS
type: Concept
change note: 2013-03-21 13:35:41.0 [mpmorahan] insert Definition (id: null text: As the Earth spins on its axis, the movement pushes ocean surface waters west away from the western edge of continents. In a process called upwelling, cool water from deep in the ocean rises to replace the surface water. Upwelling creates a layer of cool water at the surface, which cools the air immediately above the water. As the moist, marine air cools, water vapor condenses into water droplets, and low clouds form. These lumpy, sheet-like clouds are marine stratocumulus clouds, and they are a common occurrence along the western coasts of the continents, where upwelling is common. Probably no higher than a kilometer (about 3,000 feet) above the Earth’s surface, the clouds in the image hug the coastline in echo of the cool ocean currents beneath them. In contrast, warm, dry air dominates over land, keeping skies cloud free. language code: en);
change note: 2013-02-14 10:10:40.0 [mpmorahan] Insert Concept add broader relation (MARINE STRATOCUMULUS [b1d51b72-97d0-484c-b251-220f219965c2,82233] - STRATOCUMULUS [3375096a-7782-42e8-97d2-0febf63893e0,82231]);
in scheme: sciencekeywords
definition: As the Earth spins on its axis, the movement pushes ocean surface waters west away from the western edge of continents. In a process called upwelling, cool water from deep in the ocean rises to replace the surface water. Upwelling creates a layer of cool water at the surface, which cools the air immediately above the water. As the moist, marine air cools, water vapor condenses into water droplets, and low clouds form. These lumpy, sheet-like clouds are marine stratocumulus clouds, and they are a common occurrence along the western coasts of the continents, where upwelling is common. Probably no higher than a kilometer (about 3,000 feet) above the Earth’s surface, the clouds in the image hug the coastline in echo of the cool ocean currents beneath them. In contrast, warm, dry air dominates over land, keeping skies cloud free.

STRATOCUMULUS
type: Concept