ARG
type: Concept
in scheme: providers
definition: A.R. Gray & Associates was established in 1983 with the goal of providing PASSIVE COMPONENT solutions to the electronics manufacturing industry in Canada, parts of the USA and specific global markets. For the past 22 years, we have developed successful working relationships with many major OEM’s and suppliers. Summary taken from: "www.argray.ca/about.html"

COMMERCIAL
type: Concept