A - C
type: Concept

AEROMMA
type: Concept
change note: 2023-08-03 17:18:07.0 [sritz] insert AltLabel (id: null category: primary text: Atmospheric Emissions and Reactions Observed from Megacities to Marine Areas language code: en);
change note: 2023-08-03 17:17:11.0 [sritz] Insert Concept add broader relation (AEROMMA [b23d9716-54bb-4724-84b8-8b59a8f1a253,1395067] - A - C [0c89f3f4-7ab1-43ce-89ee-795d35f0e30a,1387910]);
change note: 2023-08-03 17:19:21.0 [sritz] insert Definition (id: null text: Atmospheric Emissions and Reactions Observed from Megacities to Marine Areas (AEROMMA) addresses emerging research needs in urban air quality, marine emissions, climate feedbacks, and atmospheric interactions at the marine-urban interface and future satellite capabilities of monitoring atmospheric composition over North America. AEROMMA will bring together airborne, ground, and satellite observing systems, and state-of-the-art air quality and climate models, to investigate these research topics. language code: en);
in scheme: projects
definition: Atmospheric Emissions and Reactions Observed from Megacities to Marine Areas (AEROMMA) addresses emerging research needs in urban air quality, marine emissions, climate feedbacks, and atmospheric interactions at the marine-urban interface and future satellite capabilities of monitoring atmospheric composition over North America. AEROMMA will bring together airborne, ground, and satellite observing systems, and state-of-the-art air quality and climate models, to investigate these research topics.