OCEAN CHEMISTRY
type: Concept

COLORED DISSOLVED ORGANIC MATTER
type: Concept

ORGANIC MATTER
type: Concept
change note: 2021-10-19 12:39:32.0 [tstevens] Insert Concept add narrower relation (ORGANIC MATTER [b2bdeb71-81b5-43e6-a8b1-b09c215c8d1a,776178] - COLORED DISSOLVED ORGANIC MATTER [18e0fad3-b6f4-4120-9221-f82fb2ffd384,778203]);
in scheme: sciencekeywords
definition: Dissolved or particulate substances that are hydrocarbons or hydrocarbon derivatives. Variables such as dissolved organic matter (DOM) or particulate organic matter (POM) are included as detailed variables under organic matter.